Reaction Details
TargetD(2) dopamine receptor
LigandBDBM50056443
Substrate/Competitorn/a
Meas. Tech.ChEMBL_59901 (CHEMBL883275)
EC50 165±n/a nM
Citation Cowart, MLatshaw, SPBhatia, PDaanen, JFRohde, JNelson, SLPatel, MKolasa, TNakane, MUchic, MEMiller, LNTerranova, MAChang, RDonnelly-Roberts, DLNamovic, MTHollingsworth, PRMartino, BRLynch, JJSullivan, JPHsieh, GCMoreland, RBBrioni, JDStewart, AO Discovery of 2-(4-pyridin-2-ylpiperazin-1-ylmethyl)-1H-benzimidazole (ABT-724), a dopaminergic agent with a novel mode of action for the potential treatment of erectile dysfunction. J Med Chem47:3853-64 (2004) 
 
D(2) dopamine receptor
Name:D(2) dopamine receptor
Type:Cell-surface receptors
Mol. Mass.:50647.10
Organism:Homo sapiens (Human)
Description:P14416
Residue:443
BDBM50056443
NameBDBM50056443
Synonyms:(R)-5-Methylamino-5,6-dihydro-1H,4H-imidazo[4,5,1-ij]quinolin-2-one PNU-95666E
TypeSmall organic molecule
Emp. Form.C11H13N3O
Mol. Mass.203.2404
SMILESCN[C@@H]1Cc2cccc3[nH]c(=O)n(C1)c23