Reaction Details
TargetD(2) dopamine receptor
LigandBDBM50145073
Substrate/Competitorn/a
Meas. Tech.ChEMBL_58370 (CHEMBL672807)
EC50 527±n/a nM
Citation Cowart, MLatshaw, SPBhatia, PDaanen, JFRohde, JNelson, SLPatel, MKolasa, TNakane, MUchic, MEMiller, LNTerranova, MAChang, RDonnelly-Roberts, DLNamovic, MTHollingsworth, PRMartino, BRLynch, JJSullivan, JPHsieh, GCMoreland, RBBrioni, JDStewart, AO Discovery of 2-(4-pyridin-2-ylpiperazin-1-ylmethyl)-1H-benzimidazole (ABT-724), a dopaminergic agent with a novel mode of action for the potential treatment of erectile dysfunction. J Med Chem47:3853-64 (2004) 
 
D(2) dopamine receptor
Name:D(2) dopamine receptor
Type:G Protein-Coupled Receptor (GPCR)
Mol. Mass.:50931.60
Organism:Rattus norvegicus (rat)
Description:P61169
Residue:444
BDBM50145073
NameBDBM50145073
Synonyms:5-Fluoro-2-(4-pyridin-2-yl-piperazin-1-ylmethyl)-1H-indole CP-226269
TypeSmall organic molecule
Emp. Form.C18H19FN4
Mol. Mass.310.3687
SMILESFc1ccc2[nH]c(CN3CCN(CC3)c3ccccn3)cc2c1