Reaction Details
TargetD(4) dopamine receptor
LigandBDBM50150142
Substrate/Competitorn/a
Meas. Tech.ChEMBL_61169 (CHEMBL672451)
EC50 14.6±n/a nM
Citation Cowart, MLatshaw, SPBhatia, PDaanen, JFRohde, JNelson, SLPatel, MKolasa, TNakane, MUchic, MEMiller, LNTerranova, MAChang, RDonnelly-Roberts, DLNamovic, MTHollingsworth, PRMartino, BRLynch, JJSullivan, JPHsieh, GCMoreland, RBBrioni, JDStewart, AO Discovery of 2-(4-pyridin-2-ylpiperazin-1-ylmethyl)-1H-benzimidazole (ABT-724), a dopaminergic agent with a novel mode of action for the potential treatment of erectile dysfunction. J Med Chem47:3853-64 (2004) 
 
D(4) dopamine receptor
Name:D(4) dopamine receptor
Type:Enzyme
Mol. Mass.:48373.19
Organism:Homo sapiens (Human)
Description:P21917
Residue:419
BDBM50150142
NameBDBM50150142
Synonyms:2-[4-(1H-Benzoimidazol-2-ylmethyl)-piperazin-1-yl]-benzonitrile | CHEMBL340099
TypeSmall organic molecule
Emp. Form.C19H19N5
Mol. Mass.317.3877
SMILESN#Cc1ccccc1N1CCN(Cc2nc3ccccc3[nH]2)CC1