Reaction Details
TargetD(4) dopamine receptor
LigandBDBM50150149
Substrate/Competitorn/a
Meas. Tech.ChEMBL_61168 (CHEMBL672450)
EC50 228±n/a nM
Citation Cowart, MLatshaw, SPBhatia, PDaanen, JFRohde, JNelson, SLPatel, MKolasa, TNakane, MUchic, MEMiller, LNTerranova, MAChang, RDonnelly-Roberts, DLNamovic, MTHollingsworth, PRMartino, BRLynch, JJSullivan, JPHsieh, GCMoreland, RBBrioni, JDStewart, AO Discovery of 2-(4-pyridin-2-ylpiperazin-1-ylmethyl)-1H-benzimidazole (ABT-724), a dopaminergic agent with a novel mode of action for the potential treatment of erectile dysfunction. J Med Chem47:3853-64 (2004) 
 
D(4) dopamine receptor
Name:D(4) dopamine receptor
Type:Enzyme
Mol. Mass.:48373.19
Organism:Homo sapiens (Human)
Description:P21917
Residue:419
BDBM50150149
NameBDBM50150149
Synonyms:2-(4-Phenyl-3,6-dihydro-2H-pyridin-1-ylmethyl)-1H-benzoimidazole | CHEMBL127930
TypeSmall organic molecule
Emp. Form.C19H19N3
Mol. Mass.289.3743
SMILESC(N1CCC(=CC1)c1ccccc1)c1nc2ccccc2[nH]1