Reaction Details
TargetTranslocator protein
LigandBDBM50143232
Substrate/Competitorn/a
Meas. Tech.ChEMBL_37506 (CHEMBL648136)
Ki 0.62±n/a nM
Citation Primofiore, GDa Settimo, FTaliani, SSimorini, FPatrizi, MPNovellino, EGreco, GAbignente, ECosta, BChelli, BMartini, C N,N-dialkyl-2-phenylindol-3-ylglyoxylamides. A new class of potent and selective ligands at the peripheral benzodiazepine receptor. J Med Chem47:1852-5 (2004) 
 
Translocator protein
Name:Translocator protein
Type:Mitochondrion membrane protein
Mol. Mass.:18945.84
Organism:Rattus norvegicus (rat)
Description:Competitive binding experiments were performed on rat kidney mitochondrial membranes.
Residue:169
BDBM50143232
NameBDBM50143232
Synonyms:2-(5-chloro-2-(4-chlorophenyl)-1H-indol-3-yl)-2-oxo-N,N-dipropylacetamide CHEMBL55781
TypeSmall organic molecule
Emp. Form.C22H22Cl2N2O2
Mol. Mass.417.328
SMILESCCCN(CCC)C(=O)C(=O)c1c([nH]c2ccc(Cl)cc12)-c1ccc(Cl)cc1