Reaction Details
TargetRNA-directed RNA polymerase
LigandBDBM50144945
Substrate/Competitorn/a
Meas. Tech.ChEMBL_84043 (CHEMBL691889)
IC50 47000±n/a nM
Citation Eldrup, ABAllerson, CRBennett, CFBera, SBhat, BBhat, NBosserman, MRBrooks, JBurlein, CCarroll, SSCook, PDGetty, KLMacCoss, MMcMasters, DROlsen, DBPrakash, TPPrhavc, MSong, QTomassini, JEXia, J Structure-activity relationship of purine ribonucleosides for inhibition of hepatitis C virus RNA-dependent RNA polymerase. J Med Chem47:2283-95 (2004) 
 
RNA-directed RNA polymerase
Name:RNA-directed RNA polymerase
Type:Protein
Mol. Mass.:25173.95
Organism:Hepatitis C virus
Description:Q8JXU8
Residue:229
BDBM50144945
NameBDBM50144945
Synonyms:(2R,3R,4R,5R)-2-Hydroxymethyl-4-methoxy-5-(6-methylamino-purin-9-yl)-tetrahydro-furan-3-ol 2'-O-Methyladenosine | CHEMBL73237
TypeSmall organic molecule
Emp. Form.C11H15N5O4
Mol. Mass.281.2679
SMILESCO[C@@H]1[C@H](O)[C@@H](CO)O[C@H]1n1cnc2c(N)ncnc12