Reaction Details
TargetRNA-directed RNA polymerase
LigandBDBM50144947
Substrate/Competitorn/a
Meas. Tech.ChEMBL_84043 (CHEMBL691889)
IC50 1600±n/a nM
Citation Eldrup, ABAllerson, CRBennett, CFBera, SBhat, BBhat, NBosserman, MRBrooks, JBurlein, CCarroll, SSCook, PDGetty, KLMacCoss, MMcMasters, DROlsen, DBPrakash, TPPrhavc, MSong, QTomassini, JEXia, J Structure-activity relationship of purine ribonucleosides for inhibition of hepatitis C virus RNA-dependent RNA polymerase. J Med Chem47:2283-95 (2004) 
 
RNA-directed RNA polymerase
Name:RNA-directed RNA polymerase
Type:Protein
Mol. Mass.:25173.95
Organism:Hepatitis C virus
Description:Q8JXU8
Residue:229
BDBM50144947
NameBDBM50144947
Synonyms:2-Amino-9-((2R,3R,4R,5R)-4-hydroxy-5-hydroxymethyl-3-methoxy-tetrahydro-furan-2-yl)-1,9-dihydro-purin-6-one | CHEMBL308370
TypeSmall organic molecule
Emp. Form.C11H15N5O5
Mol. Mass.297.2673
SMILESCO[C@@H]1[C@H](O)[C@@H](CO)O[C@H]1n1cnc2c1nc(N)[nH]c2=O