Reaction Details
TargetGenome polyprotein/Non-structural protein 4A
LigandBDBM50150995
Substrate/Competitorn/a
Meas. Tech.ChEMBL_303666 (CHEMBL830427)
Ki 450±n/a nM
Citation Malancona, SColarusso, SOntoria, JMMarchetti, APoma, MStansfield, ILaufer, RDi Marco, ATaliani, MVerdirame, MGonzalez-Paz, OMatassa, VGNarjes, F SAR and pharmacokinetic studies on phenethylamide inhibitors of the hepatitis C virus NS3/NS4A serine protease. Bioorg Med Chem Lett14:4575-9 (2004) 
 
Genome polyprotein/Non-structural protein 4A
Name:Genome polyprotein/Non-structural protein 4A
Synonyms:Hepatitis C virus serine protease, NS3/NS4A
Type:n/a
Mol. Mass.:n/a
Description:ASSAY_ID of ChEMBL is 1969955
Components:This complex has 2 components.
Component 1
Name:Non-structural protein 4A
Type:PROTEIN
Mol. Mass.:5762.65
Organism:Hepatitis C virus
Description:ChEMBL_305334
Residue:54
Component 2
Name:Genome polyprotein
Synonyms:Hepatitis C virus NS3 protease/helicase | Hepatitis C virus serine protease, NS3/NS4A
Type:Protein
Mol. Mass.:67067.41
Organism:Hepatitis C virus
Description:A3EZI9
Residue:631
BDBM50150995
NameBDBM50150995
Synonyms:CHEMBL263183 | [(S)-1-((2S,4S)-4-Cyclohexyl-2-{(S)-1-[2-(2,6-difluoro-4-methanesulfonylaminocarbonyl-phenyl)-ethylcarbamoyl]-3,3-difluoro-propylcarbamoyl}-pyrrolidine-1-carbonyl)-2-methyl-propyl]-carbamic acid isobutyl ester
TypeSmall organic molecule
Emp. Form.C35H51F4N5O8S
Mol. Mass.777.867
SMILESCC(C)COC(=O)N[C@@H](C(C)C)C(=O)N1C[C@@H](CC1C(=O)N[C@@H](CC(F)F)C(=O)NCCc1c(F)cc(cc1F)C(=O)NS(C)(=O)=O)C1CCCCC1