Reaction Details
TargetBeta-2 adrenergic receptor
LigandBDBM50151723
Substrate/Competitorn/a
Meas. Tech.ChEMBL_302767 (CHEMBL876356)
Ki 9.2±n/a nM
Citation Alikhani, VBeer, DBentley, DBruce, ICuenoud, BMFairhurst, RAGedeck, PHaberthuer, SHayden, CJanus, DJordan, LLewis, CSmithies, KWissler, E Long-chain formoterol analogues: an investigation into the effect of increasing amino-substituent chain length on the beta2-adrenoceptor activity. Bioorg Med Chem Lett14:4705-10 (2004) 
 
Beta-2 adrenergic receptor
Name:Beta-2 adrenergic receptor
Type:n/a
Mol. Mass.:46461.69
Organism:Homo sapiens (Human)
Description:P07550
Residue:413
BDBM50151723
NameBDBM50151723
Synonyms:CHEMBL185052 | N-[2-Hydroxy-5-((R)-1-hydroxy-2-{2-[4-(4-phenyl-butoxy)-phenyl]-ethylamino}-ethyl)-phenyl]-formamide
TypeSmall organic molecule
Emp. Form.C27H32N2O4
Mol. Mass.448.554
SMILESO[C@@H](CNCCc1ccc(OCCCCc2ccccc2)cc1)c1ccc(O)c(NC=O)c1