Reaction Details
TargetDelta-type opioid receptor
LigandBDBM50153123
Substrate/Competitorn/a
Meas. Tech.ChEMBL_303251 (CHEMBL826377)
Ki>2000±n/a nM
Citation Goehring, RRWhitehead, JFBrown, KIslam, KWen, XZhou, XChen, ZValenzano, KJMiller, WSShan, SKyle, DJ 1,3-Dihydro-2,1,3-benzothiadiazol-2,2-diones and 3,4-dihydro-1H-2,1,3-benzothidiazin-2,2-diones as ligands for the NOP receptor. Bioorg Med Chem Lett14:5045-50 (2004) 
 
Delta-type opioid receptor
Name:Delta-type opioid receptor
Type:G Protein-Coupled Receptor (GPCR)
Mol. Mass.:40382.98
Organism:Homo sapiens (Human)
Description:Competition binding assays were carried out using membrane preparations from transfected HN9.10 cells that constitutively expressed the delta opioid receptor.
Residue:372
BDBM50153123
NameBDBM50153123
Synonyms:1-[1-(1,4-Dimethyl-pentyl)-piperidin-4-yl]-3,4-dihydro-1H-benzo[1,2,6]thiadiazine 2,2-dioxide | CHEMBL184381
TypeSmall organic molecule
Emp. Form.C19H31N3O2S
Mol. Mass.365.533
SMILESCC(C)CCC(C)N1CCC(CC1)N1c2ccccc2CNS1(=O)=O