Reaction Details
TargetNociceptin receptor
LigandBDBM50153131
Substrate/Competitorn/a
Meas. Tech.ChEMBL_303155 (CHEMBL829128)
Ki 33±n/a nM
Citation Goehring, RRWhitehead, JFBrown, KIslam, KWen, XZhou, XChen, ZValenzano, KJMiller, WSShan, SKyle, DJ 1,3-Dihydro-2,1,3-benzothiadiazol-2,2-diones and 3,4-dihydro-1H-2,1,3-benzothidiazin-2,2-diones as ligands for the NOP receptor. Bioorg Med Chem Lett14:5045-50 (2004) 
 
Nociceptin receptor
Name:Nociceptin receptor
Type:G Protein-Coupled Receptor (GPCR)
Mol. Mass.:40702.87
Organism:Homo sapiens (Human)
Description:P41146
Residue:370
BDBM50153131
NameBDBM50153131
Synonyms:CHEMBL185415 | {1-[1-(4-Isopropyl-cyclohexyl)-piperidin-4-yl]-2,2-dioxo-1,4-dihydro-2H-2lambda*6*-benzo[1,2,6]thiadiazin-3-yl}-acetonitrile
TypeSmall organic molecule
Emp. Form.C23H34N4O2S
Mol. Mass.430.607
SMILESCC(C)C1CCC(CC1)N1CCC(CC1)N1c2ccccc2CN(CC#N)S1(=O)=O