Reaction Details
TargetKappa-type opioid receptor
LigandBDBM50153132
Substrate/Competitorn/a
Meas. Tech.ChEMBL_303168 (CHEMBL829979)
Ki>2000±n/a nM
Citation Goehring, RRWhitehead, JFBrown, KIslam, KWen, XZhou, XChen, ZValenzano, KJMiller, WSShan, SKyle, DJ 1,3-Dihydro-2,1,3-benzothiadiazol-2,2-diones and 3,4-dihydro-1H-2,1,3-benzothidiazin-2,2-diones as ligands for the NOP receptor. Bioorg Med Chem Lett14:5045-50 (2004) 
 
Kappa-type opioid receptor
Name:Kappa-type opioid receptor
Type:G Protein-Coupled Receptor (GPCR)
Mol. Mass.:42648.76
Organism:Homo sapiens (Human)
Description:P41145
Residue:380
BDBM50153132
NameBDBM50153132
Synonyms:2-{1-[1-(4-Isopropyl-cyclohexyl)-piperidin-4-yl]-2,2-dioxo-1,4-dihydro-2H-2lambda*6*-benzo[1,2,6]thiadiazin-3-yl}-ethanol | CHEMBL364398
TypeSmall organic molecule
Emp. Form.C23H37N3O3S
Mol. Mass.435.623
SMILESCC(C)C1CCC(CC1)N1CCC(CC1)N1c2ccccc2CN(CCO)S1(=O)=O