Reaction Details
TargetKappa-type opioid receptor
LigandBDBM50153138
Substrate/Competitorn/a
Meas. Tech.ChEMBL_303168 (CHEMBL829979)
Ki>2000±n/a nM
Citation Goehring, RRWhitehead, JFBrown, KIslam, KWen, XZhou, XChen, ZValenzano, KJMiller, WSShan, SKyle, DJ 1,3-Dihydro-2,1,3-benzothiadiazol-2,2-diones and 3,4-dihydro-1H-2,1,3-benzothidiazin-2,2-diones as ligands for the NOP receptor. Bioorg Med Chem Lett14:5045-50 (2004) 
 
Kappa-type opioid receptor
Name:Kappa-type opioid receptor
Type:G Protein-Coupled Receptor (GPCR)
Mol. Mass.:42648.76
Organism:Homo sapiens (Human)
Description:P41145
Residue:380
BDBM50153138
NameBDBM50153138
Synonyms:1-[1-(4-Benzyloxy-benzyl)-piperidin-4-yl]-1,3-dihydro-benzo[1,2,5]thiadiazole 2,2-dioxide | CHEMBL364147
TypeSmall organic molecule
Emp. Form.C25H27N3O3S
Mol. Mass.449.565
SMILESO=S1(=O)Nc2ccccc2N1C1CCN(Cc2ccc(OCc3ccccc3)cc2)CC1