Reaction Details
TargetNociceptin receptor
LigandBDBM50153137
Substrate/Competitorn/a
Meas. Tech.ChEMBL_310609 (CHEMBL837187)
EC50 78±n/a nM
Citation Goehring, RRWhitehead, JFBrown, KIslam, KWen, XZhou, XChen, ZValenzano, KJMiller, WSShan, SKyle, DJ 1,3-Dihydro-2,1,3-benzothiadiazol-2,2-diones and 3,4-dihydro-1H-2,1,3-benzothidiazin-2,2-diones as ligands for the NOP receptor. Bioorg Med Chem Lett14:5045-50 (2004) 
 
Nociceptin receptor
Name:Nociceptin receptor
Type:G Protein-Coupled Receptor (GPCR)
Mol. Mass.:40702.87
Organism:Homo sapiens (Human)
Description:P41146
Residue:370
BDBM50153137
NameBDBM50153137
Synonyms:3-Butyl-1-[1-(4-isopropyl-cyclohexyl)-piperidin-4-yl]-3,4-dihydro-1H-benzo[1,2,6]thiadiazine 2,2-dioxide | CHEMBL186773
TypeSmall organic molecule
Emp. Form.C25H41N3O2S
Mol. Mass.447.677
SMILESCCCCN1Cc2ccccc2N(C2CCN(CC2)C2CCC(CC2)C(C)C)S1(=O)=O