Reaction Details
TargetNociceptin receptor
LigandBDBM50153139
Substrate/Competitorn/a
Meas. Tech.ChEMBL_310609 (CHEMBL837187)
Ki 1878±n/a nM
Citation Goehring, RRWhitehead, JFBrown, KIslam, KWen, XZhou, XChen, ZValenzano, KJMiller, WSShan, SKyle, DJ 1,3-Dihydro-2,1,3-benzothiadiazol-2,2-diones and 3,4-dihydro-1H-2,1,3-benzothidiazin-2,2-diones as ligands for the NOP receptor. Bioorg Med Chem Lett14:5045-50 (2004) 
 
Nociceptin receptor
Name:Nociceptin receptor
Type:G Protein-Coupled Receptor (GPCR)
Mol. Mass.:40702.87
Organism:Homo sapiens (Human)
Description:P41146
Residue:370
BDBM50153139
NameBDBM50153139
Synonyms:1-[1-(4-Benzyloxy-benzyl)-piperidin-4-yl]-3,4-dihydro-1H-benzo[1,2,6]thiadiazine 2,2-dioxide | CHEMBL361926
TypeSmall organic molecule
Emp. Form.C26H29N3O3S
Mol. Mass.463.592
SMILESO=S1(=O)NCc2ccccc2N1C1CCN(Cc2ccc(OCc3ccccc3)cc2)CC1