Reaction Details
TargetMu-type opioid receptor
LigandBDBM50153126
Substrate/Competitorn/a
Meas. Tech.ChEMBL_303169 (CHEMBL829980)
Ki 5545±n/a nM
Citation Goehring, RRWhitehead, JFBrown, KIslam, KWen, XZhou, XChen, ZValenzano, KJMiller, WSShan, SKyle, DJ 1,3-Dihydro-2,1,3-benzothiadiazol-2,2-diones and 3,4-dihydro-1H-2,1,3-benzothidiazin-2,2-diones as ligands for the NOP receptor. Bioorg Med Chem Lett14:5045-50 (2004) 
 
Mu-type opioid receptor
Name:Mu-type opioid receptor
Type:G Protein-Coupled Receptor (GPCR)
Mol. Mass.:44789.51
Organism:Homo sapiens (Human)
Description:P35372
Residue:400
BDBM50153126
NameBDBM50153126
Synonyms:1-[1-(Decahydro-naphthalen-2-yl)-piperidin-4-yl]-1,3-dihydro-benzo[1,2,5]thiadiazole 2,2-dioxide | CHEMBL184646
TypeSmall organic molecule
Emp. Form.C21H31N3O2S
Mol. Mass.389.555
SMILESO=S1(=O)Nc2ccccc2N1C1CCN(CC1)C1CCC2CCCCC2C1