Reaction Details
TargetDual specificity calcium/calmodulin-dependent 3',5'-cyclic nucleotide phosphodiesterase 1A/1B
LigandBDBM14390
Substrate/Competitorn/a
Meas. Tech.ChEMBL_305208 (CHEMBL832461)
IC50 561±n/a nM
Citation Xia, GLi, JPeng, ALai, SZhang, SShen, JLiu, ZChen, XJi, R Synthesis and phosphodiesterase 5 inhibitory activity of novel pyrido[1,2-e]purin-4(3H)-one derivatives. Bioorg Med Chem Lett15:2790-4 (2005) 
 
Dual specificity calcium/calmodulin-dependent 3',5'-cyclic nucleotide phosphodiesterase 1A/1B
Name:Dual specificity calcium/calmodulin-dependent 3',5'-cyclic nucleotide phosphodiesterase 1A/1B
Synonyms:Phosphodiesterase 1
Type:n/a
Mol. Mass.:n/a
Description:ASSAY_ID of ChEMBL is 156011
Components:This complex has 2 components.
Component 1
Name:Dual specificity calcium/calmodulin-dependent 3',5'-cyclic nucleotide phosphodiesterase 1B
Type:PROTEIN
Mol. Mass.:60991.90
Organism:Bos taurus
Description:ChEMBL_104913
Residue:534
Component 2
Name:Dual specificity calcium/calmodulin-dependent 3',5'-cyclic nucleotide phosphodiesterase 1A
Synonyms:Calcium/calmodulin-dependent 3',5'-cyclic nucleotide phosphodiesterase 1A PDE1A Phosphodiesterase 1 | Phosphodiesterase 1A
Type:Enzyme Catalytic Domain
Mol. Mass.:60835.05
Organism:BOVINE
Description:Phosphodiesterase 1 0 BOVINE::P14100
Residue:530
BDBM14390
NameBDBM14390
Synonyms:5-[2-ethoxy-5-(4-methyl-1-piperazinylsulfonyl)phenyl]-1-methyl-3-n-propyl-1,6-dihydro-7H-pyrazolo[4,3-d]pyrimidin-7-one CHEMBL192 Sildenafil US11155558, Compound sildenafil US11897890, Compound sildenafil | Viagra
TypeSmall organic molecule
Emp. Form.C22H30N6O4S
Mol. Mass.474.576
SMILESCCCc1nn(C)c2c1nc([nH]c2=O)-c1cc(ccc1OCC)S(=O)(=O)N1CCN(C)CC1