Reaction Details
TargetAdenosine receptor A2a
LigandBDBM50166737
Substrate/Competitorn/a
Meas. Tech.ChEMBL_303764 (CHEMBL829986)
Ki 2570±n/a nM
Citation Press, NJTaylor, RJFullerton, JDTranter, PMcCarthy, CKeller, THBrown, LCheung, RChristie, JHaberthuer, SHatto, JDKeenan, MMercer, MKPress, NESahri, HTuffnell, ARTweed, MFozard, JR A new orally bioavailable dual adenosine A2B/A3 receptor antagonist with therapeutic potential. Bioorg Med Chem Lett15:3081-5 (2005) 
 
Adenosine receptor A2a
Name:Adenosine receptor A2a
Type:G Protein-Coupled Receptor (GPCR)
Mol. Mass.:44716.46
Organism:Homo sapiens (Human)
Description:P29274
Residue:412
BDBM50166737
NameBDBM50166737
Synonyms:3-[2-(Pyridin-3-ylamino)-5-[1,2,4]triazol-1-yl-thiazol-4-yl]-benzonitrile | CHEMBL193977
TypeSmall organic molecule
Emp. Form.C17H11N7S
Mol. Mass.345.381
SMILESN#Cc1cccc(c1)-c1nc(Nc2cccnc2)sc1-n1cncn1