Reaction Details
TargetAdenosine receptor A2a
LigandBDBM50166741
Substrate/Competitorn/a
Meas. Tech.ChEMBL_303764 (CHEMBL829986)
Ki 5610±n/a nM
Citation Press, NJTaylor, RJFullerton, JDTranter, PMcCarthy, CKeller, THBrown, LCheung, RChristie, JHaberthuer, SHatto, JDKeenan, MMercer, MKPress, NESahri, HTuffnell, ARTweed, MFozard, JR A new orally bioavailable dual adenosine A2B/A3 receptor antagonist with therapeutic potential. Bioorg Med Chem Lett15:3081-5 (2005) 
 
Adenosine receptor A2a
Name:Adenosine receptor A2a
Type:G Protein-Coupled Receptor (GPCR)
Mol. Mass.:44716.46
Organism:Homo sapiens (Human)
Description:P29274
Residue:412
BDBM50166741
NameBDBM50166741
Synonyms:4-(3-cyanophenyl)-5-(1H-1,2,4-triazol-1-yl)-1,3-thiazol-2-ylcarbamate
TypeSmall organic molecule
Emp. Form.C13H7N6O2S
Mol. Mass.311.299
SMILES[O-]C(=O)Nc1nc(c(s1)-n1cncn1)-c1cccc(c1)C#N