Reaction Details
TargetCarbonic anhydrase 2
LigandBDBM50171010
Substrate/Competitorn/a
Meas. Tech.ChEMBL_302944 (CHEMBL841779)
Ki 19±n/a nM
Citation Mincione, FStarnotti, MMasini, EBacciottini, LScrivanti, CCasini, AVullo, DScozzafava, ASupuran, CT Carbonic anhydrase inhibitors: design of thioureido sulfonamides with potent isozyme II and XII inhibitory properties and intraocular pressure lowering activity in a rabbit model of glaucoma. Bioorg Med Chem Lett15:3821-7 (2005) 
 
Carbonic anhydrase 2
Name:Carbonic anhydrase 2
Type:Enzyme
Mol. Mass.:29250.71
Organism:Homo sapiens (Human)
Description:P00918
Residue:260
BDBM50171010
NameBDBM50171010
Synonyms:CHEMBL362636 | N-[4-(aminosulfonyl)phenyl]-2-(pentafluorophenyl)triazane-1-carbothioamide
TypeSmall organic molecule
Emp. Form.C13H10F5N5O2S2
Mol. Mass.427.373
SMILESNN(NC(=S)Nc1ccc(cc1)S(N)(=O)=O)c1c(F)c(F)c(F)c(F)c1F