Reaction Details
TargetCarbonic anhydrase 2
LigandBDBM50171014
Substrate/Competitorn/a
Meas. Tech.ChEMBL_302944 (CHEMBL841779)
Ki 6±n/a nM
Citation Mincione, FStarnotti, MMasini, EBacciottini, LScrivanti, CCasini, AVullo, DScozzafava, ASupuran, CT Carbonic anhydrase inhibitors: design of thioureido sulfonamides with potent isozyme II and XII inhibitory properties and intraocular pressure lowering activity in a rabbit model of glaucoma. Bioorg Med Chem Lett15:3821-7 (2005) 
 
Carbonic anhydrase 2
Name:Carbonic anhydrase 2
Type:Enzyme
Mol. Mass.:29250.71
Organism:Homo sapiens (Human)
Description:P00918
Residue:260
BDBM50171014
NameBDBM50171014
Synonyms:CHEMBL179355 | N-{2-[4-(aminosulfonyl)phenyl]ethyl}-2-(2-fluorophenyl)hydrazinecarbothioamide
TypeSmall organic molecule
Emp. Form.C15H17FN4O2S2
Mol. Mass.368.449
SMILESNS(=O)(=O)c1ccc(CCNC(=S)NNc2ccccc2F)cc1