Reaction Details
TargetCarbonic anhydrase 1
LigandBDBM50171016
Substrate/Competitorn/a
Meas. Tech.ChEMBL_302924 (CHEMBL830383)
Ki 40±n/a nM
Citation Mincione, FStarnotti, MMasini, EBacciottini, LScrivanti, CCasini, AVullo, DScozzafava, ASupuran, CT Carbonic anhydrase inhibitors: design of thioureido sulfonamides with potent isozyme II and XII inhibitory properties and intraocular pressure lowering activity in a rabbit model of glaucoma. Bioorg Med Chem Lett15:3821-7 (2005) 
 
Carbonic anhydrase 1
Name:Carbonic anhydrase 1
Type:Enzyme
Mol. Mass.:28873.37
Organism:Homo sapiens (Human)
Description:P00915
Residue:261
BDBM50171016
NameBDBM50171016
Synonyms:4-{2-[3-(2-Amino-acetyl)-thioureido]-ethyl}-benzenesulfonamide; compound with GENERIC INORGANIC NEUTRAL COMPONENT | CHEMBL178560
TypeSmall organic molecule
Emp. Form.C11H16N4O3S2
Mol. Mass.316.4
SMILESNCC(=O)NC(=S)NCCc1ccc(cc1)S(N)(=O)=O