Reaction Details
TargetCarbonic anhydrase 2
LigandBDBM11640
Substrate/Competitorn/a
Meas. Tech.ChEMBL_302944 (CHEMBL841779)
Ki 25±n/a nM
Citation Mincione, FStarnotti, MMasini, EBacciottini, LScrivanti, CCasini, AVullo, DScozzafava, ASupuran, CT Carbonic anhydrase inhibitors: design of thioureido sulfonamides with potent isozyme II and XII inhibitory properties and intraocular pressure lowering activity in a rabbit model of glaucoma. Bioorg Med Chem Lett15:3821-7 (2005) 
 
Carbonic anhydrase 2
Name:Carbonic anhydrase 2
Type:Enzyme
Mol. Mass.:29250.71
Organism:Homo sapiens (Human)
Description:P00918
Residue:260
BDBM11640
NameBDBM11640
Synonyms:3-[(2,3,4,5,6-pentafluorophenyl)amino]-1-(4-sulfamoylphenyl)thiourea Compound 9 | fluorine-containing thiourea 9
TypeSmall organic molecule
Emp. Form.C13H9F5N4O2S2
Mol. Mass.412.358
SMILESNS(=O)(=O)c1ccc(NC(=S)NNc2c(F)c(F)c(F)c(F)c2F)cc1