Reaction Details
TargetCarbonic anhydrase 1
LigandBDBM50171019
Substrate/Competitorn/a
Meas. Tech.ChEMBL_302924 (CHEMBL830383)
Ki 324±n/a nM
Citation Mincione, FStarnotti, MMasini, EBacciottini, LScrivanti, CCasini, AVullo, DScozzafava, ASupuran, CT Carbonic anhydrase inhibitors: design of thioureido sulfonamides with potent isozyme II and XII inhibitory properties and intraocular pressure lowering activity in a rabbit model of glaucoma. Bioorg Med Chem Lett15:3821-7 (2005) 
 
Carbonic anhydrase 1
Name:Carbonic anhydrase 1
Type:Enzyme
Mol. Mass.:28873.37
Organism:Homo sapiens (Human)
Description:P00915
Residue:261
BDBM50171019
NameBDBM50171019
Synonyms:4-{2-[({2-[4-(aminosulfonyl)phenyl]ethyl}amino)carbonothioyl]hydrazino}benzoic acid | CHEMBL180195
TypeSmall organic molecule
Emp. Form.C16H18N4O4S2
Mol. Mass.394.469
SMILESNS(=O)(=O)c1ccc(CCNC(=S)NNc2ccc(cc2)C(O)=O)cc1