Reaction Details
TargetCarbonic anhydrase 2
LigandBDBM50171027
Substrate/Competitorn/a
Meas. Tech.ChEMBL_302944 (CHEMBL841779)
Ki 150±n/a nM
Citation Mincione, FStarnotti, MMasini, EBacciottini, LScrivanti, CCasini, AVullo, DScozzafava, ASupuran, CT Carbonic anhydrase inhibitors: design of thioureido sulfonamides with potent isozyme II and XII inhibitory properties and intraocular pressure lowering activity in a rabbit model of glaucoma. Bioorg Med Chem Lett15:3821-7 (2005) 
 
Carbonic anhydrase 2
Name:Carbonic anhydrase 2
Type:Enzyme
Mol. Mass.:29250.71
Organism:Homo sapiens (Human)
Description:P00918
Residue:260
BDBM50171027
NameBDBM50171027
Synonyms:CHEMBL178664 | Thioureido sulfonamide
TypeSmall organic molecule
Emp. Form.C17H31N7O2S2
Mol. Mass.429.604
SMILESNCCCN1CCN(CCCNNC(=S)Nc2ccc(cc2)S(N)(=O)=O)CC1