Reaction Details
TargetCarbonic anhydrase 1
LigandBDBM50171028
Substrate/Competitorn/a
Meas. Tech.ChEMBL_302924 (CHEMBL830383)
Ki 72±n/a nM
Citation Mincione, FStarnotti, MMasini, EBacciottini, LScrivanti, CCasini, AVullo, DScozzafava, ASupuran, CT Carbonic anhydrase inhibitors: design of thioureido sulfonamides with potent isozyme II and XII inhibitory properties and intraocular pressure lowering activity in a rabbit model of glaucoma. Bioorg Med Chem Lett15:3821-7 (2005) 
 
Carbonic anhydrase 1
Name:Carbonic anhydrase 1
Type:Enzyme
Mol. Mass.:28873.37
Organism:Homo sapiens (Human)
Description:P00915
Residue:261
BDBM50171028
NameBDBM50171028
Synonyms:CHEMBL360254 | N-{2-[4-(aminosulfonyl)phenyl]ethyl}-2-(4-methylpiperazin-1-yl)hydrazinecarbothioamide
TypeSmall organic molecule
Emp. Form.C14H24N6O2S2
Mol. Mass.372.509
SMILESCN1CCN(CC1)NNC(=S)NCCc1ccc(cc1)S(N)(=O)=O