Reaction Details
TargetCarbonic anhydrase 12
LigandBDBM50171019
Substrate/Competitorn/a
Meas. Tech.ChEMBL_303378 (CHEMBL877449)
Ki 144±n/a nM
Citation Mincione, FStarnotti, MMasini, EBacciottini, LScrivanti, CCasini, AVullo, DScozzafava, ASupuran, CT Carbonic anhydrase inhibitors: design of thioureido sulfonamides with potent isozyme II and XII inhibitory properties and intraocular pressure lowering activity in a rabbit model of glaucoma. Bioorg Med Chem Lett15:3821-7 (2005) 
 
Carbonic anhydrase 12
Name:Carbonic anhydrase 12
Type:Enzyme
Mol. Mass.:39456.00
Organism:Homo sapiens (Human)
Description:Catalytic domain of human cloned isozyme was used in the assay
Residue:354
BDBM50171019
NameBDBM50171019
Synonyms:4-{2-[({2-[4-(aminosulfonyl)phenyl]ethyl}amino)carbonothioyl]hydrazino}benzoic acid | CHEMBL180195
TypeSmall organic molecule
Emp. Form.C16H18N4O4S2
Mol. Mass.394.469
SMILESNS(=O)(=O)c1ccc(CCNC(=S)NNc2ccc(cc2)C(O)=O)cc1