Reaction Details
TargetCarbonic anhydrase 2
LigandBDBM50171030
Substrate/Competitorn/a
Meas. Tech.ChEMBL_302944 (CHEMBL841779)
Ki 27±n/a nM
Citation Mincione, FStarnotti, MMasini, EBacciottini, LScrivanti, CCasini, AVullo, DScozzafava, ASupuran, CT Carbonic anhydrase inhibitors: design of thioureido sulfonamides with potent isozyme II and XII inhibitory properties and intraocular pressure lowering activity in a rabbit model of glaucoma. Bioorg Med Chem Lett15:3821-7 (2005) 
 
Carbonic anhydrase 2
Name:Carbonic anhydrase 2
Type:Enzyme
Mol. Mass.:29250.71
Organism:Homo sapiens (Human)
Description:P00918
Residue:260
BDBM50171030
NameBDBM50171030
Synonyms:4-{3-[2-Hydroxy-1-hydroxymethyl-2-(4-nitro-phenyl)-ethyl]-thioureido}-benzenesulfonamide | CHEMBL413357
TypeSmall organic molecule
Emp. Form.C16H18N4O6S2
Mol. Mass.426.467
SMILESNS(=O)(=O)c1ccc(NC(=[SH+])[N-]C(CO)C(O)c2ccc(cc2)[N+]([O-])=O)cc1