Reaction Details
TargetProgesterone receptor
LigandBDBM50151060
Substrate/Competitorn/a
Meas. Tech.ChEMBL_302537 (CHEMBL827389)
Ki 3.5±n/a nM
Citation von Geldern, TWTu, NKym, PRLink, JTJae, HSLai, CApelqvist, TRhonnstad, PHagberg, LKoehler, KGrynfarb, MGoos-Nilsson, ASandberg, JOsterlund, MBarkhem, THöglund, MWang, JFung, SWilcox, DNguyen, PJakob, CHutchins, CFärnegårdh, MKauppi, BOhman, LJacobson, PB Liver-selective glucocorticoid antagonists: a novel treatment for type 2 diabetes. J Med Chem47:4213-30 (2004) 
 
Progesterone receptor
Name:Progesterone receptor
Type:Protein
Mol. Mass.:98979.52
Organism:Homo sapiens (Human)
Description:P06401
Residue:933
BDBM50151060
NameBDBM50151060
Synonyms:(4R)-4-[(1S,2S,7S,9R,10R,11S,14R,15R,16S)-5-({[2-({4-[(10S,11S,14R,15S,17R)-14-ethynyl-14-hydroxy-15-methyl-5-oxotetracyclo[8.7.0.0^{2,7}.0^{11,15}]heptadeca-1,6-dien-17-yl]phenyl}(methyl)amino)ethyl]carbamoyl}(methyl)amino)-9,16-dihydroxy-2,15-dimethyltetracyclo[8.7.0.0^{2,7}.0^{11,15}]heptadecan-14-yl]pentanoic acid | CHEMBL384975
TypeSmall organic molecule
Emp. Form.C55H77N3O7
Mol. Mass.892.2158
SMILESC[C@H](CCC(O)=O)[C@H]1CC[C@H]2[C@@H]3[C@H](O)C[C@@H]4CC(CC[C@]4(C)[C@H]3C[C@H](O)[C@]12C)N(C)C(=O)NCCN(C)c1ccc(cc1)[C@H]1C[C@@]2(C)[C@@H](CC[C@@]2(O)C#C)[C@@H]2CCC3=CC(=O)CCC3=C12