Reaction Details
TargetP2Y purinoceptor 1
LigandBDBM2
Substrate/Competitorn/a
Meas. Tech.ChEMBL_310399 (CHEMBL833177)
EC50 590±n/a nM
Citation Major, DTNahum, VWang, YReiser, GFischer, B Molecular recognition in purinergic receptors. 2. Diastereoselectivity of the h-P2Y1-receptor. J Med Chem47:4405-16 (2004) 
 
P2Y purinoceptor 1
Name:P2Y purinoceptor 1
Type:PROTEIN
Mol. Mass.:42338.46
Organism:Rattus norvegicus
Description:ChEMBL_873671
Residue:373
BDBM2
NameBDBM2
Synonyms:({[({[(2R,3S,4R,5R)-5-(6-amino-9H-purin-9-yl)-3,4-dihydroxyoxolan-2-yl]methoxy}(hydroxy)phosphoryl)oxy](hydroxy)phosphoryl}oxy)phosphonic acid Brimonidine ATP | CHEMBL14249
TypeNucleoside or nucleotide
Emp. Form.C10H16N5O13P3
Mol. Mass.507.181
SMILESNc1ncnc2n(cnc12)[C@@H]1O[C@H](COP(O)(=O)OP(O)(=O)OP(O)(O)=O)[C@@H](O)[C@H]1O