Reaction Details
TargetGenome polyprotein
LigandBDBM50158822
Substrate/Competitorn/a
Meas. Tech.ChEMBL_305160 (CHEMBL832751)
IC50 350±n/a nM
Citation Gordon, CPKeller, PA Control of hepatitis C: a medicinal chemistry perspective. J Med Chem48:1-20 (2005) 
 
Genome polyprotein
Name:Genome polyprotein
Type:Protein
Mol. Mass.:327266.82
Organism:Hepatitis C virus (HCV)
Description:P26664
Residue:3011
BDBM50158822
NameBDBM50158822
Synonyms:4-[2-(5-Bromo-2-cyano-phenoxy)-phenyl]-2,4-dioxo-butyric acid | CHEMBL446360
TypeSmall organic molecule
Emp. Form.C17H10BrNO5
Mol. Mass.388.169
SMILESOC(=O)C(=O)CC(=O)c1ccccc1Oc1cc(Br)ccc1C#N