Reaction Details
TargetGenome polyprotein
LigandBDBM50158845
Substrate/Competitorn/a
Meas. Tech.ChEMBL_305160 (CHEMBL832751)
IC50 100±n/a nM
Citation Gordon, CPKeller, PA Control of hepatitis C: a medicinal chemistry perspective. J Med Chem48:1-20 (2005) 
 
Genome polyprotein
Name:Genome polyprotein
Type:Protein
Mol. Mass.:327266.82
Organism:Hepatitis C virus (HCV)
Description:P26664
Residue:3011
BDBM50158845
NameBDBM50158845
Synonyms:2-(3-(3-(2-chlorobenzyl)ureido)thiophen-2-yl)-5,6-dihydroxypyrimidine-4-carboxylic acid 2-{3-[3-(2-Chloro-benzyl)-ureido]-thiophen-2-yl}-5-hydroxy-6-oxo-1,6-dihydro-pyrimidine-4-carboxylic acid | CHEMBL175882
TypeSmall organic molecule
Emp. Form.C17H13ClN4O5S
Mol. Mass.420.827
SMILESOC(=O)c1nc([nH]c(=O)c1O)-c1sccc1NC(=O)NCc1ccccc1Cl