Reaction Details
TargetGenome polyprotein
LigandBDBM50158847
Substrate/Competitorn/a
Meas. Tech.ChEMBL_305214 (CHEMBL832467)
IC50 13±n/a nM
Citation Gordon, CPKeller, PA Control of hepatitis C: a medicinal chemistry perspective. J Med Chem48:1-20 (2005) 
 
Genome polyprotein
Name:Genome polyprotein
Type:Protein
Mol. Mass.:67067.41
Organism:Hepatitis C virus
Description:A3EZI9
Residue:631
BDBM50158847
NameBDBM50158847
Synonyms:(R)-1-{[(2S,4R)-1-[(S)-2-((S)-2-Acetylamino-2-cyclohexyl-acetylamino)-3-methyl-butyryl]-4-(2-phenyl-quinolin-4-yloxy)-pyrrolidine-2-carbonyl]-amino}-2-vinyl-cyclopropanecarboxylic acid | CHEMBL175948
TypeSmall organic molecule
Emp. Form.C41H49N5O7
Mol. Mass.723.8571
SMILESCC(C)[C@H](NC(=O)[C@@H](NC(C)=O)C1CCCCC1)C(=O)N1C[C@@H](C[C@H]1C(=O)N[C@@]1(C[C@@H]1C=C)C(O)=O)Oc1cc(nc2ccccc12)-c1ccccc1