Reaction Details
TargetCorticotropin-releasing factor receptor 1
LigandBDBM50168464
Substrate/Competitorn/a
Meas. Tech.ChEMBL_303632 (CHEMBL828842)
Ki 6.5±n/a nM
Citation Dyck, BGrigoriadis, DEGross, RSGuo, ZHaddach, MMarinkovic, DMcCarthy, JRMoorjani, MRegan, CFSaunders, JSchwaebe, MKSzabo, TWilliams, JPZhang, XBozigian, HChen, TK Potent, orally active corticotropin-releasing factor receptor-1 antagonists containing a tricyclic pyrrolopyridine or pyrazolopyridine core. J Med Chem48:4100-10 (2005) 
 
Corticotropin-releasing factor receptor 1
Name:Corticotropin-releasing factor receptor 1
Type:Enzyme
Mol. Mass.:50744.31
Organism:Homo sapiens (Human)
Description:P34998
Residue:444
BDBM50168464
NameBDBM50168464
Synonyms:1-(4-Methoxy-2-methyl-phenyl)-7-methyl-5-(1-propyl-butyl)-1,3,4,5-tetrahydro-1,5,8-triaza-acenaphthylene | CHEMBL195152
TypeSmall organic molecule
Emp. Form.C25H33N3O
Mol. Mass.391.549
SMILESCCCC(CCC)N1CCc2cn(-c3ccc(OC)cc3C)c3nc(C)cc1c23