Reaction Details
TargetCorticotropin-releasing factor receptor 1
LigandBDBM50168465
Substrate/Competitorn/a
Meas. Tech.ChEMBL_303632 (CHEMBL828842)
Ki 13±n/a nM
Citation Dyck, BGrigoriadis, DEGross, RSGuo, ZHaddach, MMarinkovic, DMcCarthy, JRMoorjani, MRegan, CFSaunders, JSchwaebe, MKSzabo, TWilliams, JPZhang, XBozigian, HChen, TK Potent, orally active corticotropin-releasing factor receptor-1 antagonists containing a tricyclic pyrrolopyridine or pyrazolopyridine core. J Med Chem48:4100-10 (2005) 
 
Corticotropin-releasing factor receptor 1
Name:Corticotropin-releasing factor receptor 1
Type:Enzyme
Mol. Mass.:50744.31
Organism:Homo sapiens (Human)
Description:P34998
Residue:444
BDBM50168465
NameBDBM50168465
Synonyms:5-Chloro-2-[7-methyl-5-(1-propyl-butyl)-4,5-dihydro-3H-1,5,8-triaza-acenaphthylen-1-yl]-benzonitrile | CHEMBL370501
TypeSmall organic molecule
Emp. Form.C24H27ClN4
Mol. Mass.406.951
SMILESCCCC(CCC)N1CCc2cn(-c3ccc(Cl)cc3C#N)c3nc(C)cc1c23