Reaction Details
TargetCorticotropin-releasing factor receptor 1
LigandBDBM50168462
Substrate/Competitorn/a
Meas. Tech.ChEMBL_303632 (CHEMBL828842)
Ki 2.9±n/a nM
Citation Dyck, BGrigoriadis, DEGross, RSGuo, ZHaddach, MMarinkovic, DMcCarthy, JRMoorjani, MRegan, CFSaunders, JSchwaebe, MKSzabo, TWilliams, JPZhang, XBozigian, HChen, TK Potent, orally active corticotropin-releasing factor receptor-1 antagonists containing a tricyclic pyrrolopyridine or pyrazolopyridine core. J Med Chem48:4100-10 (2005) 
 
Corticotropin-releasing factor receptor 1
Name:Corticotropin-releasing factor receptor 1
Type:Enzyme
Mol. Mass.:50744.31
Organism:Homo sapiens (Human)
Description:P34998
Residue:444
BDBM50168462
NameBDBM50168462
Synonyms:2-(2,4-Dichloro-phenyl)-4-methyl-6-(1-propyl-butyl)-2,6,7,8-tetrahydro-1,2,3,6-tetraaza-acenaphthylene | CHEMBL363414
TypeSmall organic molecule
Emp. Form.C22H26Cl2N4
Mol. Mass.417.375
SMILESCCCC(CCC)N1CCc2nn(-c3ccc(Cl)cc3Cl)c3nc(C)cc1c23