Reaction Details
TargetCorticotropin-releasing factor receptor 1
LigandBDBM50168478
Substrate/Competitorn/a
Meas. Tech.ChEMBL_303632 (CHEMBL828842)
Ki 30±n/a nM
Citation Dyck, BGrigoriadis, DEGross, RSGuo, ZHaddach, MMarinkovic, DMcCarthy, JRMoorjani, MRegan, CFSaunders, JSchwaebe, MKSzabo, TWilliams, JPZhang, XBozigian, HChen, TK Potent, orally active corticotropin-releasing factor receptor-1 antagonists containing a tricyclic pyrrolopyridine or pyrazolopyridine core. J Med Chem48:4100-10 (2005) 
 
Corticotropin-releasing factor receptor 1
Name:Corticotropin-releasing factor receptor 1
Type:Enzyme
Mol. Mass.:50744.31
Organism:Homo sapiens (Human)
Description:P34998
Residue:444
BDBM50168478
NameBDBM50168478
Synonyms:7-Methyl-5-(1-propyl-butyl)-1-p-tolyl-1,3,4,5-tetrahydro-1,5,8-triaza-acenaphthylene | CHEMBL191755
TypeSmall organic molecule
Emp. Form.C24H31N3
Mol. Mass.361.523
SMILESCCCC(CCC)N1CCc2cn(-c3ccc(C)cc3)c3nc(C)cc1c23