Reaction Details
TargetReverse transcriptase/RNaseH
LigandBDBM50169065
Substrate/Competitorn/a
Meas. Tech.ChEMBL_304235 (CHEMBL829774)
EC50 30±n/a nM
Citation De Martino, GLa Regina, GDi Pasquali, ARagno, RBergamini, ACiaprini, CSinistro, AMaga, GCrespan, EArtico, MSilvestri, R Novel 1-[2-(diarylmethoxy)ethyl]-2-methyl-5-nitroimidazoles as HIV-1 non-nucleoside reverse transcriptase inhibitors. A structure-activity relationship investigation. J Med Chem48:4378-88 (2005) 
 
Reverse transcriptase/RNaseH
Name:Reverse transcriptase/RNaseH
Type:PROTEIN
Mol. Mass.:65229.15
Organism:Human immunodeficiency virus 1
Description:ChEMBL_1473730
Residue:566
BDBM50169065
NameBDBM50169065
Synonyms:2-Methyl-5-nitro-1-[2-(phenyl-thiophen-2-yl-methoxy)-ethyl]-1H-imidazole | CHEMBL190879
TypeSmall organic molecule
Emp. Form.C17H17N3O3S
Mol. Mass.343.4
SMILESCc1ncc(n1CCOC(c1cccs1)c1ccccc1)[N+]([O-])=O