Reaction Details
TargetReverse transcriptase/RNaseH
LigandBDBM50169066
Substrate/Competitorn/a
Meas. Tech.ChEMBL_310383 (CHEMBL833564)
EC50 2300±n/a nM
Citation De Martino, GLa Regina, GDi Pasquali, ARagno, RBergamini, ACiaprini, CSinistro, AMaga, GCrespan, EArtico, MSilvestri, R Novel 1-[2-(diarylmethoxy)ethyl]-2-methyl-5-nitroimidazoles as HIV-1 non-nucleoside reverse transcriptase inhibitors. A structure-activity relationship investigation. J Med Chem48:4378-88 (2005) 
 
Reverse transcriptase/RNaseH
Name:Reverse transcriptase/RNaseH
Type:PROTEIN
Mol. Mass.:65229.15
Organism:Human immunodeficiency virus 1
Description:ChEMBL_1473730
Residue:566
BDBM50169066
NameBDBM50169066
Synonyms:1-(2-Benzhydrylsulfanyl-ethyl)-2-methyl-5-nitro-1H-imidazole | CHEMBL191155
TypeSmall organic molecule
Emp. Form.C19H19N3O2S
Mol. Mass.353.438
SMILESCc1ncc(n1CCSC(c1ccccc1)c1ccccc1)[N+]([O-])=O