Reaction Details
TargetAcetylcholinesterase
LigandBDBM8960
Substrate/Competitorn/a
Meas. Tech.ChEMBL_305786 (CHEMBL874440)
IC50 22±n/a nM
Citation Luo, WYu, QSZhan, MParrish, DDeschamps, JRKulkarni, SSHolloway, HWAlley, GMLahiri, DKBrossi, AGreig, NH Novel anticholinesterases based on the molecular skeletons of furobenzofuran and methanobenzodioxepine. J Med Chem48:986-94 (2005) 
 
Acetylcholinesterase
Name:Acetylcholinesterase
Type:Enzyme
Mol. Mass.:67792.70
Organism:Homo sapiens (Human)
Description:P22303
Residue:614
BDBM8960
NameBDBM8960
Synonyms:(+/-)-2-[(1-benzylpiperidin-4-yl)methyl]-5,6-dimethoxy-indan-1-one Aricept CHEMBL1678 CHEMBL502 Donepezil E2020 US9346818, DPH US9663465, Donepezil
TypeSmall organic molecule
Emp. Form.C24H29NO3
Mol. Mass.379.492
SMILESCOc1cc2CC(CC3CCN(Cc4ccccc4)CC3)C(=O)c2cc1OC