Reaction Details
TargetCorticotropin-releasing factor receptor 1
LigandBDBM50054245
Substrate/Competitorn/a
Meas. Tech.ChEMBL_303624 (CHEMBL828835)
Ki 2±n/a nM
Citation Lowe, RFNelson, JDang, TNCrowe, PDPahuja, AMcCarthy, JRGrigoriadis, DEConlon, PSaunders, JChen, CSzabo, TChen, TKBozigian, H Rational design, synthesis, and structure-activity relationships of aryltriazoles as novel corticotropin-releasing factor-1 receptor antagonists. J Med Chem48:1540-9 (2005) 
 
Corticotropin-releasing factor receptor 1
Name:Corticotropin-releasing factor receptor 1
Type:Enzyme
Mol. Mass.:50744.31
Organism:Homo sapiens (Human)
Description:P34998
Residue:444
BDBM50054245
NameBDBM50054245
Synonyms:5-Chloro-N-cyclopropylmethyl-2-methyl-N-propyl-N''-(2,4,6-trichloro-phenyl)-pyrimidine-4,6-diamine CHEMBL45281 | cid_176157
TypeSmall organic molecule
Emp. Form.C18H20Cl4N4
Mol. Mass.434.19
SMILESCCCN(CC1CC1)c1nc(C)nc(Nc2c(Cl)cc(Cl)cc2Cl)c1Cl