Reaction Details
TargetAdenosine receptor A2a
LigandBDBM50152215
Substrate/Competitorn/a
Meas. Tech.ChEMBL_303283 (CHEMBL828276)
Ki 4±n/a nM
Citation Vu, CBPan, DPeng, BKumaravel, GSmits, GJin, XPhadke, DEngber, THuang, CReilly, JTam, SGrant, DHetu, GPetter, RC Novel diamino derivatives of [1,2,4]triazolo[1,5-a][1,3,5]triazine as potent and selective adenosine A2a receptor antagonists. J Med Chem48:2009-18 (2005) 
 
Adenosine receptor A2a
Name:Adenosine receptor A2a
Type:G Protein-Coupled Receptor (GPCR)
Mol. Mass.:45015.65
Organism:Rattus norvegicus (rat)
Description:Rat A2A receptors expressed in CHO cells.
Residue:410
BDBM50152215
NameBDBM50152215
Synonyms:7N-[1-(2-chloro-4-pyridylmethyl)-(2R)-tetrahydro-1H-2-pyrrolylmethyl]-2-(2-furyl)[1,2,4]triazolo[1,5-a][1,3,5]triazine-5,7-diamine N*5*-[(R)-1-(2-Chloro-pyridin-4-ylmethyl)-pyrrolidin-2-ylmethyl]-2-furan-2-yl-[1,2,4]triazolo[1,5-a][1,3,5]triazine-5,7-diamine
TypeSmall organic molecule
Emp. Form.C19H20ClN9O
Mol. Mass.425.875
SMILESNc1nc(NC[C@H]2CCCN2Cc2ccnc(Cl)c2)nc2nc(nn12)-c1ccco1