Reaction Details
TargetAdenosine receptor A2a
LigandBDBM50156604
Substrate/Competitorn/a
Meas. Tech.ChEMBL_303283 (CHEMBL828276)
Ki 4±n/a nM
Citation Vu, CBPan, DPeng, BKumaravel, GSmits, GJin, XPhadke, DEngber, THuang, CReilly, JTam, SGrant, DHetu, GPetter, RC Novel diamino derivatives of [1,2,4]triazolo[1,5-a][1,3,5]triazine as potent and selective adenosine A2a receptor antagonists. J Med Chem48:2009-18 (2005) 
 
Adenosine receptor A2a
Name:Adenosine receptor A2a
Type:G Protein-Coupled Receptor (GPCR)
Mol. Mass.:45015.65
Organism:Rattus norvegicus (rat)
Description:Rat A2A receptors expressed in CHO cells.
Residue:410
BDBM50156604
NameBDBM50156604
Synonyms:CHEMBL173672 N5-(((R)-1-(2,6-difluorobenzyl)pyrrolidin-2-yl)methyl)-2-(furan-2-yl)-[1,2,4]triazolo[1,5-a][1,3,5]triazine-5,7-diamine
TypeSmall organic molecule
Emp. Form.C20H20F2N8O
Mol. Mass.426.4226
SMILESNc1nc(NC[C@H]2CCCN2Cc2c(F)cccc2F)nc2nc(nn12)-c1ccco1