Reaction Details
TargetNeuronal acetylcholine receptor subunit alpha-7
LigandBDBM50093255
Substrate/Competitorn/a
Meas. Tech.ChEMBL_303347 (CHEMBL839662)
Ki 340±n/a nM
Citation Tatsumi, RFujio, MSatoh, HKatayama, JTakanashi, SHashimoto, KTanaka, H Discovery of the alpha7 nicotinic acetylcholine receptor agonists. (R)-3'-(5-Chlorothiophen-2-yl)spiro-1-azabicyclo[2.2.2]octane-3,5'-[1',3']oxazolidin-2'-one as a novel, potent, selective, and orally bioavailable ligand. J Med Chem48:2678-86 (2005) 
 
Neuronal acetylcholine receptor subunit alpha-7
Name:Neuronal acetylcholine receptor subunit alpha-7
Type:Enzyme
Mol. Mass.:56502.44
Organism:Rattus norvegicus (Rat)
Description:Q05941
Residue:502
BDBM50093255
NameBDBM50093255
Synonyms:(+)-Spiro[1-azabicyclo[2.2.2]octane-3,5'-oxazolidin-2'-one] 1'-azaspiro[oxazolidine-5,3'-bicyclo[2.2.2]octan]-2-one CHEMBL293975 | Spiro[1-azabicyclo[2.2.2]octane-3,5'-oxazolidin-2'-one]
TypeSmall organic molecule
Emp. Form.C9H14N2O2
Mol. Mass.182.2197
SMILESO=C1NCC2(CN3CCC2CC3)O1