Reaction Details
TargetNeuronal acetylcholine receptor subunit alpha-7
LigandBDBM50164621
Substrate/Competitorn/a
Meas. Tech.ChEMBL_303347 (CHEMBL839662)
Ki 31±n/a nM
Citation Tatsumi, RFujio, MSatoh, HKatayama, JTakanashi, SHashimoto, KTanaka, H Discovery of the alpha7 nicotinic acetylcholine receptor agonists. (R)-3'-(5-Chlorothiophen-2-yl)spiro-1-azabicyclo[2.2.2]octane-3,5'-[1',3']oxazolidin-2'-one as a novel, potent, selective, and orally bioavailable ligand. J Med Chem48:2678-86 (2005) 
 
Neuronal acetylcholine receptor subunit alpha-7
Name:Neuronal acetylcholine receptor subunit alpha-7
Type:Enzyme
Mol. Mass.:56502.44
Organism:Rattus norvegicus (Rat)
Description:Q05941
Residue:502
BDBM50164621
NameBDBM50164621
Synonyms:(2R)-3'-(2-naphthyl)-2'H-spiro[4-azabicyclo[2.2.2]octane-2,5'-[1,3]oxazolidin]-2'-one | CHEMBL192478
TypeSmall organic molecule
Emp. Form.C19H20N2O2
Mol. Mass.308.3743
SMILESO=C1O[C@@]2(CN1c1ccc3ccccc3c1)CN1CCC2CC1