Reaction Details
TargetPolyprenyl synthetase family protein
LigandBDBM50165353
Substrate/Competitorn/a
Meas. Tech.ChEMBL_302625 (CHEMBL839917)
Ki 20±n/a nM
Citation Sanders, JMSong, YChan, JMZhang, YJennings, SKosztowski, TOdeh, SFlessner, RSchwerdtfeger, CKotsikorou, EMeints, GAGómez, AOGonzález-Pacanowska, DRaker, AMWang, Hvan Beek, ERPapapoulos, SEMorita, CTOldfield, E Pyridinium-1-yl bisphosphonates are potent inhibitors of farnesyl diphosphate synthase and bone resorption. J Med Chem48:2957-63 (2005) 
 
Polyprenyl synthetase family protein
Name:Polyprenyl synthetase family protein
Type:PROTEIN
Mol. Mass.:41078.35
Organism:Plasmodium falciparum (isolate 3D7)
Description:ChEMBL_330072
Residue:362
BDBM50165353
NameBDBM50165353
Synonyms:CHEMBL373332 | hydrogen 2-(3-butylpyridinium-1-yl)-1-hydroxy-1-phosphonoethylphosphonate
TypeSmall organic molecule
Emp. Form.C11H19NO7P2
Mol. Mass.339.2186
SMILESCCCCc1ccc[n+](CC(O)(P(O)(O)=O)P(O)([O-])=O)c1