Reaction Details
Target3-oxo-5-alpha-steroid 4-dehydrogenase 2
LigandBDBM50334788
Substrate/Competitorn/a
Meas. Tech.ChEBML_306524
IC50 2±n/a nM
Citation Handratta, VDVasaitis, TSNjar, VCGediya, LKKataria, RChopra, PNewman, DFarquhar, RGuo, ZQiu, YBrodie, AM Novel C-17-heteroaryl steroidal CYP17 inhibitors/antiandrogens: synthesis, in vitro biological activity, pharmacokinetics, and antitumor activity in the LAPC4 human prostate cancer xenograft model. J Med Chem48:2972-84 (2005) 
 
3-oxo-5-alpha-steroid 4-dehydrogenase 2
Name:3-oxo-5-alpha-steroid 4-dehydrogenase 2
Type:Enzyme
Mol. Mass.:28406.59
Organism:Homo sapiens (Human)
Description:P31213
Residue:254
BDBM50334788
NameBDBM50334788
Synonyms:(17beta-(N-tert-butylcarbamoyl)-4-aza-5alpha-androst-1-en-3-one (4aR,4bS,6aS,7S,9aS,9bS,11aR)-N-tert-butyl-4a,6a-dimethyl-2-oxo-2,4a,4b,5,6,6a,7,8,9,9a,9b,10,11,11a-tetradecahydro-1H-indeno[5,4-f]quinoline-7-carboxamide (4aR,6aS)-4a,6a-Dimethyl-2-oxo-2,4a,4b,5,6,6a,7,8,9,9a,9b,10,11,11a-tetradecahydro-1H-indeno[5,4-f]quinoline-7-carboxylic acid tert-butylamide (4aR,6aS,7S)-4a,6a-Dimethyl-2-oxo-2,4a,4b,5,6,6a,7,8,9,9a,9b,10,11,11a-tetradecahydro-1H-indeno[5,4-f]quinoline-7-carboxylic acid tert-butylamide (R)-4a,6a-Dimethyl-2-oxo-2,4a,4b,5,6,6a,7,8,9,9a,9b,10,11,11a-tetradecahydro-1H-indeno[5,4-f]quinoline-7-carboxylic acid tert-butylamide 4a,6a-Dimethyl-2-oxo-2,4a,4b,5,6,6a,7,8,9,9a,9b,10,11,11a-tetradecahydro-1H-indeno[5,4-f]quinoline-7-carboxylic acid tert-butylamide CHEMBL710 MK-906 Proscar | US9061023, Finasteride
TypeSmall organic molecule
Emp. Form.C23H36N2O2
Mol. Mass.372.5441
SMILESCC(C)(C)NC(=O)[C@H]1CC[C@H]2[C@@H]3CC[C@H]4NC(=O)C=C[C@]4(C)[C@H]3CC[C@]12C