Reaction Details
TargetCaspase-1
LigandBDBM50189360
Substrate/Competitorn/a
Meas. Tech.ChEMBL_321472 (CHEMBL880413)
IC50 2±n/a nM
Citation Oppong, KAEllis, CDLaufersweiler, MCO'Neil, SVWang, YSoper, DLBaize, MWWos, JADe, BBosch, GKFancher, ANLu, WSuchanek, MKWang, RLDemuth, TP Discovery of novel conformationally restricted diazocan peptidomimetics as inhibitors of interleukin-1beta synthesis. Bioorg Med Chem Lett15:4291-4 (2005) 
 
Caspase-1
Name:Caspase-1
Type:Enzyme
Mol. Mass.:45154.13
Organism:Homo sapiens (Human)
Description:P29466
Residue:404
BDBM50189360
NameBDBM50189360
Synonyms:(1S,10S)-9-[(Isoquinoline-1-carbonyl)-amino]-6,10-dioxo-octahydro-pyridazino[1,2-a][1,2]diazepine-1-carboxylic acid ((S)-2-ethoxy-5-oxo-tetrahydro-furan-3-yl)-amide | (1S,9S)-N-((2R,3S)-2-ethoxy-5-oxo-tetrahydrofuran-3-yl)-9-(isoquinoline-1-carboxamido)-6,10-dioxo-octahydro-1H-pyridazino[1,2-a][1,2]diazepine-1-carboxamide
TypeSmall organic molecule
Emp. Form.C26H29N5O7
Mol. Mass.523.5378
SMILESCCO[C@@H]1OC(=O)C[C@@H]1NC(=O)[C@@H]1CCCN2N1C(=O)[C@H](CCC2=O)NC(=O)c1nccc2ccccc12