Reaction Details
TargetDeoxyuridine 5'-triphosphate nucleotidohydrolase
LigandBDBM50190545
Substrate/Competitorn/a
Meas. Tech.ChEMBL_320965 (CHEMBL885372)
Ki 2800±n/a nM
Citation Nguyen, CKasinathan, GLeal-Cortijo, IMusso-Buendia, AKaiser, MBrun, RRuiz-Pérez, LMJohansson, NGGonzález-Pacanowska, DGilbert, IH Deoxyuridine triphosphate nucleotidohydrolase as a potential antiparasitic drug target. J Med Chem48:5942-54 (2005) 
 
Deoxyuridine 5'-triphosphate nucleotidohydrolase
Name:Deoxyuridine 5'-triphosphate nucleotidohydrolase
Synonyms:dUTP pyrophosphatase
Type:Protein
Mol. Mass.:19574.43
Organism:Plasmodium falciparum
Description:Q8II92
Residue:173
BDBM50190545
NameBDBM50190545
TypeSmall organic molecule
Emp. Form.C27H26N2O5Si
Mol. Mass.486.5912
SMILESO[C@H]1C[C@@H](O[C@@H]1CO[Si](c1ccccc1)(c1ccccc1)c1ccccc1)n1ccc(=O)[nH]c1=O