Reaction Details
TargetDeoxyuridine 5'-triphosphate nucleotidohydrolase, mitochondrial
LigandBDBM50173567
Substrate/Competitorn/a
Meas. Tech.ChEMBL_320930 (CHEMBL881474)
Ki>1000000±n/a nM
Citation Nguyen, CKasinathan, GLeal-Cortijo, IMusso-Buendia, AKaiser, MBrun, RRuiz-Pérez, LMJohansson, NGGonzález-Pacanowska, DGilbert, IH Deoxyuridine triphosphate nucleotidohydrolase as a potential antiparasitic drug target. J Med Chem48:5942-54 (2005) 
 
Deoxyuridine 5'-triphosphate nucleotidohydrolase, mitochondrial
Name:Deoxyuridine 5'-triphosphate nucleotidohydrolase, mitochondrial
Type:Enzyme
Mol. Mass.:26574.03
Organism:Homo sapiens (Human)
Description:P33316
Residue:252
BDBM50173567
NameBDBM50173567
Synonyms:1-[5-(tert-Butyl-dimethyl-silanyloxymethyl)-4-fluoro-tetrahydro-furan-2-yl]-1H-pyrimidine-2,4-dione dUTPase inhibitor, 6
TypeSmall organic molecule
Emp. Form.C15H25FN2O4Si
Mol. Mass.344.4539
SMILESCC(C)(C)[Si](C)(C)OCC1OC(CC1F)n1ccc(=O)[nH]c1=O